web-dev-qa-db-ja.com

Androidプロジェクト評価リスナーへの通知に失敗しました

Macbookを出荷時設定にリセットした後、この奇妙な問題に直面しています。 Android studioはプロジェクトをビルドできず、ビルドするたびに同じ問題を示しています。

注:私は、stackoverflowでさまざまな同じスレッドを見つけましたが、どれも私にとってはうまくいきませんでした。それが私がスタックオーバーフローに入れなければならなかった理由です。

enter image description here

Gradleコンソールとマニフェスト情報は以下にあります:

Grandleコンソールログ:

[![Executing tasks: \[clean, :app:generateDebugSources, :utilities:generateDebugSources\]

Configuration on demand is an incubating feature.
Configuration 'compile' in project ':app' is deprecated. Use 'implementation' instead.
registerResGeneratingTask is deprecated, use registerGeneratedFolders(FileCollection)
registerResGeneratingTask is deprecated, use registerGeneratedFolders(FileCollection)
app: 'androidProcessor' dependencies won't be recognized as kapt annotation processors. Please change the configuration name to 'kapt' for these artifacts: 'com.Android.databinding:compiler:3.0.1'.
Configuration 'compile' in project ':utilities' is deprecated. Use 'implementation' instead.
Configuration 'debugCompile' in project ':utilities' is deprecated. Use 'debugImplementation' instead.
utilities: 'androidProcessor' dependencies won't be recognized as kapt annotation processors. Please change the configuration name to 'kapt' for these artifacts: 'com.github.bumptech.glide:compiler:4.4.0' and apply the kapt plugin: "apply plugin: 'kotlin-kapt'".

FAILURE: Build failed with an exception.

* What went wrong:
A problem occurred configuring project ':app'.
> Failed to notify project evaluation listener.
   > Java.lang.reflect.InvocationTargetException (no error message)

* Try:
Run with --info or --debug option to get more log output.

* Exception is:
org.gradle.api.ProjectConfigurationException: A problem occurred configuring project ':app'.
    at org.gradle.configuration.project.LifecycleProjectEvaluator.addConfigurationFailure(LifecycleProjectEvaluator.Java:87)
    at org.gradle.configuration.project.LifecycleProjectEvaluator.notifyAfterEvaluate(LifecycleProjectEvaluator.Java:82)
    at org.gradle.configuration.project.LifecycleProjectEvaluator.doConfigure(LifecycleProjectEvaluator.Java:69)
    at org.gradle.configuration.project.LifecycleProjectEvaluator.access$100(LifecycleProjectEvaluator.Java:33)
    at org.gradle.configuration.project.LifecycleProjectEvaluator$ConfigureProject.run(LifecycleProjectEvaluator.Java:103)
    at org.gradle.internal.progress.DefaultBuildOperationExecutor$RunnableBuildOperationWorker.execute(DefaultBuildOperationExecutor.Java:336)
    at org.gradle.internal.progress.DefaultBuildOperationExecutor$RunnableBuildOperationWorker.execute(DefaultBuildOperationExecutor.Java:328)
    at org.gradle.internal.progress.DefaultBuildOperationExecutor.execute(DefaultBuildOperationExecutor.Java:197)
    at org.gradle.internal.progress.DefaultBuildOperationExecutor.run(DefaultBuildOperationExecutor.Java:107)
    at org.gradle.configuration.project.LifecycleProjectEvaluator.evaluate(LifecycleProjectEvaluator.Java:49)
    at org.gradle.api.internal.project.DefaultProject.evaluate(DefaultProject.Java:651)
    at org.gradle.api.internal.project.DefaultProject.evaluate(DefaultProject.Java:133)
    at org.gradle.execution.TaskPathProjectEvaluator.configure(TaskPathProjectEvaluator.Java:35)
    at org.gradle.execution.TaskPathProjectEvaluator.configureHierarchy(TaskPathProjectEvaluator.Java:62)
    at org.gradle.execution.TaskSelector.getSelection(TaskSelector.Java:100)
    at org.gradle.execution.TaskSelector.getSelection(TaskSelector.Java:81)
    at org.gradle.execution.commandline.CommandLineTaskParser.parseTasks(CommandLineTaskParser.Java:42)
    at org.gradle.execution.TaskNameResolvingBuildConfigurationAction.configure(TaskNameResolvingBuildConfigurationAction.Java:44)
    at org.gradle.execution.DefaultBuildConfigurationActionExecuter.configure(DefaultBuildConfigurationActionExecuter.Java:48)
    at org.gradle.execution.DefaultBuildConfigurationActionExecuter.access$000(DefaultBuildConfigurationActionExecuter.Java:25)
    at org.gradle.execution.DefaultBuildConfigurationActionExecuter$1.proceed(DefaultBuildConfigurationActionExecuter.Java:54)
    at org.gradle.execution.DefaultTasksBuildExecutionAction.configure(DefaultTasksBuildExecutionAction.Java:44)
    at org.gradle.execution.DefaultBuildConfigurationActionExecuter.configure(DefaultBuildConfigurationActionExecuter.Java:48)
    at org.gradle.execution.DefaultBuildConfigurationActionExecuter.access$000(DefaultBuildConfigurationActionExecuter.Java:25)
    at org.gradle.execution.DefaultBuildConfigurationActionExecuter$1.proceed(DefaultBuildConfigurationActionExecuter.Java:54)
    at org.gradle.execution.ExcludedTaskFilteringBuildConfigurationAction.configure(ExcludedTaskFilteringBuildConfigurationAction.Java:47)
    at org.gradle.execution.DefaultBuildConfigurationActionExecuter.configure(DefaultBuildConfigurationActionExecuter.Java:48)
    at org.gradle.execution.DefaultBuildConfigurationActionExecuter.select(DefaultBuildConfigurationActionExecuter.Java:36)
    at org.gradle.initialization.DefaultGradleLauncher$CalculateTaskGraph.run(DefaultGradleLauncher.Java:265)
    at org.gradle.internal.progress.DefaultBuildOperationExecutor$RunnableBuildOperationWorker.execute(DefaultBuildOperationExecutor.Java:336)
    at org.gradle.internal.progress.DefaultBuildOperationExecutor$RunnableBuildOperationWorker.execute(DefaultBuildOperationExecutor.Java:328)
    at org.gradle.internal.progress.DefaultBuildOperationExecutor.execute(DefaultBuildOperationExecutor.Java:197)
    at org.gradle.internal.progress.DefaultBuildOperationExecutor.run(DefaultBuildOperationExecutor.Java:107)
    at org.gradle.initialization.DefaultGradleLauncher.constructTaskGraph(DefaultGradleLauncher.Java:173)
    at org.gradle.initialization.DefaultGradleLauncher.doBuildStages(DefaultGradleLauncher.Java:128)
    at org.gradle.initialization.DefaultGradleLauncher.executeTasks(DefaultGradleLauncher.Java:107)
    at org.gradle.internal.invocation.GradleBuildController$1.call(GradleBuildController.Java:78)
    at org.gradle.internal.invocation.GradleBuildController$1.call(GradleBuildController.Java:75)
    at org.gradle.internal.work.DefaultWorkerLeaseService.withLocks(DefaultWorkerLeaseService.Java:152)
    at org.gradle.internal.invocation.GradleBuildController.doBuild(GradleBuildController.Java:100)
    at org.gradle.internal.invocation.GradleBuildController.run(GradleBuildController.Java:75)
    at org.gradle.tooling.internal.provider.runner.BuildModelActionRunner.run(BuildModelActionRunner.Java:53)
    at org.gradle.launcher.exec.ChainingBuildActionRunner.run(ChainingBuildActionRunner.Java:35)
    at org.gradle.launcher.exec.ChainingBuildActionRunner.run(ChainingBuildActionRunner.Java:35)
    at org.gradle.tooling.internal.provider.ValidatingBuildActionRunner.run(ValidatingBuildActionRunner.Java:32)
    at org.gradle.launcher.exec.RunAsBuildOperationBuildActionRunner$1.run(RunAsBuildOperationBuildActionRunner.Java:43)
    at org.gradle.internal.progress.DefaultBuildOperationExecutor$RunnableBuildOperationWorker.execute(DefaultBuildOperationExecutor.Java:336)
    at org.gradle.internal.progress.DefaultBuildOperationExecutor$RunnableBuildOperationWorker.execute(DefaultBuildOperationExecutor.Java:328)
    at org.gradle.internal.progress.DefaultBuildOperationExecutor.execute(DefaultBuildOperationExecutor.Java:197)
    at org.gradle.internal.progress.DefaultBuildOperationExecutor.run(DefaultBuildOperationExecutor.Java:107)
    at org.gradle.launcher.exec.RunAsBuildOperationBuildActionRunner.run(RunAsBuildOperationBuildActionRunner.Java:40)
    at org.gradle.tooling.internal.provider.SubscribableBuildActionRunner.run(SubscribableBuildActionRunner.Java:51)
    at org.gradle.launcher.exec.InProcessBuildActionExecuter.execute(InProcessBuildActionExecuter.Java:45)
    at org.gradle.launcher.exec.InProcessBuildActionExecuter.execute(InProcessBuildActionExecuter.Java:29)
    at org.gradle.launcher.exec.BuildTreeScopeBuildActionExecuter.execute(BuildTreeScopeBuildActionExecuter.Java:39)
    at org.gradle.launcher.exec.BuildTreeScopeBuildActionExecuter.execute(BuildTreeScopeBuildActionExecuter.Java:25)
    at org.gradle.tooling.internal.provider.ContinuousBuildActionExecuter.execute(ContinuousBuildActionExecuter.Java:71)
    at org.gradle.tooling.internal.provider.ContinuousBuildActionExecuter.execute(ContinuousBuildActionExecuter.Java:45)
    at org.gradle.tooling.internal.provider.ServicesSetupBuildActionExecuter.execute(ServicesSetupBuildActionExecuter.Java:51)
    at org.gradle.tooling.internal.provider.ServicesSetupBuildActionExecuter.execute(ServicesSetupBuildActionExecuter.Java:32)
    at org.gradle.tooling.internal.provider.GradleThreadBuildActionExecuter.execute(GradleThreadBuildActionExecuter.Java:36)
    at org.gradle.tooling.internal.provider.GradleThreadBuildActionExecuter.execute(GradleThreadBuildActionExecuter.Java:25)
    at org.gradle.tooling.internal.provider.ParallelismConfigurationBuildActionExecuter.execute(ParallelismConfigurationBuildActionExecuter.Java:43)
    at org.gradle.tooling.internal.provider.ParallelismConfigurationBuildActionExecuter.execute(ParallelismConfigurationBuildActionExecuter.Java:29)
    at org.gradle.tooling.internal.provider.StartParamsValidatingActionExecuter.execute(StartParamsValidatingActionExecuter.Java:64)
    at org.gradle.tooling.internal.provider.StartParamsValidatingActionExecuter.execute(StartParamsValidatingActionExecuter.Java:29)
    at org.gradle.tooling.internal.provider.SessionFailureReportingActionExecuter.execute(SessionFailureReportingActionExecuter.Java:55)
    at org.gradle.tooling.internal.provider.SessionFailureReportingActionExecuter.execute(SessionFailureReportingActionExecuter.Java:42)
    at org.gradle.tooling.internal.provider.SetupLoggingActionExecuter.execute(SetupLoggingActionExecuter.Java:58)
    at org.gradle.tooling.internal.provider.SetupLoggingActionExecuter.execute(SetupLoggingActionExecuter.Java:33)
    at org.gradle.launcher.daemon.server.exec.ExecuteBuild.doBuild(ExecuteBuild.Java:67)
    at org.gradle.launcher.daemon.server.exec.BuildCommandOnly.execute(BuildCommandOnly.Java:36)
    at org.gradle.launcher.daemon.server.api.DaemonCommandExecution.proceed(DaemonCommandExecution.Java:120)
    at org.gradle.launcher.daemon.server.exec.WatchForDisconnection.execute(WatchForDisconnection.Java:37)
    at org.gradle.launcher.daemon.server.api.DaemonCommandExecution.proceed(DaemonCommandExecution.Java:120)
    at org.gradle.launcher.daemon.server.exec.ResetDeprecationLogger.execute(ResetDeprecationLogger.Java:26)
    at org.gradle.launcher.daemon.server.api.DaemonCommandExecution.proceed(DaemonCommandExecution.Java:120)
    at org.gradle.launcher.daemon.server.exec.RequestStopIfSingleUsedDaemon.execute(RequestStopIfSingleUsedDaemon.Java:34)
    at org.gradle.launcher.daemon.server.api.DaemonCommandExecution.proceed(DaemonCommandExecution.Java:120)
    at org.gradle.launcher.daemon.server.exec.ForwardClientInput$2.call(ForwardClientInput.Java:74)
    at org.gradle.launcher.daemon.server.exec.ForwardClientInput$2.call(ForwardClientInput.Java:72)
    at org.gradle.util.Swapper.swap(Swapper.Java:38)
    at org.gradle.launcher.daemon.server.exec.ForwardClientInput.execute(ForwardClientInput.Java:72)
    at org.gradle.launcher.daemon.server.api.DaemonCommandExecution.proceed(DaemonCommandExecution.Java:120)
    at org.gradle.launcher.daemon.server.exec.LogAndCheckHealth.execute(LogAndCheckHealth.Java:55)
    at org.gradle.launcher.daemon.server.api.DaemonCommandExecution.proceed(DaemonCommandExecution.Java:120)
    at org.gradle.launcher.daemon.server.exec.LogToClient.doBuild(LogToClient.Java:62)
    at org.gradle.launcher.daemon.server.exec.BuildCommandOnly.execute(BuildCommandOnly.Java:36)
    at org.gradle.launcher.daemon.server.api.DaemonCommandExecution.proceed(DaemonCommandExecution.Java:120)
    at org.gradle.launcher.daemon.server.exec.EstablishBuildEnvironment.doBuild(EstablishBuildEnvironment.Java:82)
    at org.gradle.launcher.daemon.server.exec.BuildCommandOnly.execute(BuildCommandOnly.Java:36)
    at org.gradle.launcher.daemon.server.api.DaemonCommandExecution.proceed(DaemonCommandExecution.Java:120)
    at org.gradle.launcher.daemon.server.exec.StartBuildOrRespondWithBusy$1.run(StartBuildOrRespondWithBusy.Java:50)
    at org.gradle.launcher.daemon.server.DaemonStateCoordinator$1.run(DaemonStateCoordinator.Java:297)
    at org.gradle.internal.concurrent.ExecutorPolicy$CatchAndRecordFailures.onExecute(ExecutorPolicy.Java:63)
    at org.gradle.internal.concurrent.ManagedExecutorImpl$1.run(ManagedExecutorImpl.Java:46)
    at org.gradle.internal.concurrent.ThreadFactoryImpl$ManagedThreadRunnable.run(ThreadFactoryImpl.Java:55)
Caused by: org.gradle.internal.event.ListenerNotificationException: Failed to notify project evaluation listener.
    at org.gradle.internal.event.AbstractBroadcastDispatch.dispatch(AbstractBroadcastDispatch.Java:86)
    at org.gradle.internal.event.BroadcastDispatch$CompositeDispatch.dispatch(BroadcastDispatch.Java:324)
    at org.gradle.internal.event.BroadcastDispatch$CompositeDispatch.dispatch(BroadcastDispatch.Java:234)
    at org.gradle.internal.event.ListenerBroadcast.dispatch(ListenerBroadcast.Java:140)
    at org.gradle.internal.event.ListenerBroadcast.dispatch(ListenerBroadcast.Java:37)
    at org.gradle.internal.dispatch.ProxyDispatchAdapter$DispatchingInvocationHandler.invoke(ProxyDispatchAdapter.Java:93)
    at com.Sun.proxy.$Proxy25.afterEvaluate(Unknown Source)
    at org.gradle.configuration.project.LifecycleProjectEvaluator.notifyAfterEvaluate(LifecycleProjectEvaluator.Java:75)
    ... 95 more
Caused by: Java.lang.reflect.InvocationTargetException
    at org.jetbrains.kotlin.gradle.plugin.Android25ProjectHandler.computeResourceSetList0(Android25ProjectHandler.kt:156)
    at org.jetbrains.kotlin.gradle.plugin.Android25ProjectHandler.getResDirectories(Android25ProjectHandler.kt:123)
    at org.jetbrains.kotlin.gradle.plugin.Android25ProjectHandler.getResDirectories(Android25ProjectHandler.kt:21)
    at org.jetbrains.kotlin.gradle.internal.AndroidSubplugin$applyExperimental$3.invoke(AndroidSubplugin.kt:172)
    at org.jetbrains.kotlin.gradle.internal.AndroidSubplugin$applyExperimental$3.invoke(AndroidSubplugin.kt:76)
    at org.jetbrains.kotlin.gradle.plugin.Android25ProjectHandlerKt$sam$Action$4ca85ddb.execute(Android25ProjectHandler.kt)
    at org.gradle.api.internal.DefaultDomainObjectCollection.all(DefaultDomainObjectCollection.Java:136)
    at org.jetbrains.kotlin.gradle.plugin.Android25ProjectHandler.forEachVariant(Android25ProjectHandler.kt:27)
    at org.jetbrains.kotlin.gradle.internal.AndroidSubplugin.applyExperimental(AndroidSubplugin.kt:170)
    at org.jetbrains.kotlin.gradle.internal.AndroidSubplugin.apply(AndroidSubplugin.kt:102)
    at org.jetbrains.kotlin.gradle.internal.AndroidSubplugin.apply(AndroidSubplugin.kt:76)
    at org.jetbrains.kotlin.gradle.plugin.SubpluginEnvironment.addSubpluginOptions(KotlinPlugin.kt:794)
    at org.jetbrains.kotlin.gradle.plugin.AbstractAndroidProjectHandler.processVariant(KotlinPlugin.kt:629)
    at org.jetbrains.kotlin.gradle.plugin.AbstractAndroidProjectHandler.access$processVariant(KotlinPlugin.kt:477)
    at org.jetbrains.kotlin.gradle.plugin.AbstractAndroidProjectHandler$handleProject$2$1.invoke(KotlinPlugin.kt:547)
    at org.jetbrains.kotlin.gradle.plugin.AbstractAndroidProjectHandler$handleProject$2$1.invoke(KotlinPlugin.kt:477)
    at org.jetbrains.kotlin.gradle.plugin.Android25ProjectHandlerKt$sam$Action$4ca85ddb.execute(Android25ProjectHandler.kt)
    at org.gradle.api.internal.DefaultDomainObjectCollection.all(DefaultDomainObjectCollection.Java:136)
    at org.jetbrains.kotlin.gradle.plugin.Android25ProjectHandler.forEachVariant(Android25ProjectHandler.kt:27)
    at org.jetbrains.kotlin.gradle.plugin.AbstractAndroidProjectHandler$handleProject$2.execute(KotlinPlugin.kt:546)
    at org.jetbrains.kotlin.gradle.plugin.AbstractAndroidProjectHandler$handleProject$2.execute(KotlinPlugin.kt:477)
    at org.gradle.internal.event.BroadcastDispatch$ActionInvocationHandler.dispatch(BroadcastDispatch.Java:91)
    at org.gradle.internal.event.BroadcastDispatch$ActionInvocationHandler.dispatch(BroadcastDispatch.Java:80)
    at org.gradle.internal.event.AbstractBroadcastDispatch.dispatch(AbstractBroadcastDispatch.Java:42)
    at org.gradle.internal.event.BroadcastDispatch$SingletonDispatch.dispatch(BroadcastDispatch.Java:230)
    at org.gradle.internal.event.BroadcastDispatch$SingletonDispatch.dispatch(BroadcastDispatch.Java:149)
    at org.gradle.internal.event.AbstractBroadcastDispatch.dispatch(AbstractBroadcastDispatch.Java:58)
    ... 102 more
Caused by: org.gradle.api.artifacts.ResolveException: Could not resolve all dependencies for configuration ':app:debugRuntimeClasspath'.
    at org.gradle.api.internal.artifacts.ivyservice.ErrorHandlingConfigurationResolver.wrapException(ErrorHandlingConfigurationResolver.Java:96)
    at org.gradle.api.internal.artifacts.ivyservice.ErrorHandlingConfigurationResolver.resolveGraph(ErrorHandlingConfigurationResolver.Java:68)
    at org.gradle.api.internal.artifacts.configurations.DefaultConfiguration$4.run(DefaultConfiguration.Java:469)
    at org.gradle.internal.progress.DefaultBuildOperationExecutor$RunnableBuildOperationWorker.execute(DefaultBuildOperationExecutor.Java:336)
    at org.gradle.internal.progress.DefaultBuildOperationExecutor$RunnableBuildOperationWorker.execute(DefaultBuildOperationExecutor.Java:328)
    at org.gradle.internal.progress.DefaultBuildOperationExecutor.execute(DefaultBuildOperationExecutor.Java:197)
    at org.gradle.internal.progress.DefaultBuildOperationExecutor.run(DefaultBuildOperationExecutor.Java:107)
    at org.gradle.api.internal.artifacts.configurations.DefaultConfiguration.resolveGraphIfRequired(DefaultConfiguration.Java:461)
    at org.gradle.api.internal.artifacts.configurations.DefaultConfiguration.resolveToStateOrLater(DefaultConfiguration.Java:437)
    at org.gradle.api.internal.artifacts.configurations.DefaultConfiguration.access$1600(DefaultConfiguration.Java:114)
    at org.gradle.api.internal.artifacts.configurations.DefaultConfiguration$ConfigurationFileCollection.getSelectedArtifacts(DefaultConfiguration.Java:865)
    at org.gradle.api.internal.artifacts.configurations.DefaultConfiguration$ConfigurationFileCollection.access$2600(DefaultConfiguration.Java:799)
    at org.gradle.api.internal.artifacts.configurations.DefaultConfiguration$ConfigurationArtifactCollection.ensureResolved(DefaultConfiguration.Java:1211)
    at org.gradle.api.internal.artifacts.configurations.DefaultConfiguration$ConfigurationArtifactCollection.getArtifacts(DefaultConfiguration.Java:1189)
    at com.Android.build.gradle.tasks.MergeResources.computeResourceSetList(MergeResources.Java:664)
    ... 129 more
Caused by: org.gradle.api.ProjectConfigurationException: A problem occurred configuring project ':utilities'.
    at org.gradle.configuration.project.LifecycleProjectEvaluator.addConfigurationFailure(LifecycleProjectEvaluator.Java:87)
    at org.gradle.configuration.project.LifecycleProjectEvaluator.notifyAfterEvaluate(LifecycleProjectEvaluator.Java:82)
    at org.gradle.configuration.project.LifecycleProjectEvaluator.doConfigure(LifecycleProjectEvaluator.Java:69)
    at org.gradle.configuration.project.LifecycleProjectEvaluator.access$100(LifecycleProjectEvaluator.Java:33)
    at org.gradle.configuration.project.LifecycleProjectEvaluator$ConfigureProject.run(LifecycleProjectEvaluator.Java:103)
    at org.gradle.internal.progress.DefaultBuildOperationExecutor$RunnableBuildOperationWorker.execute(DefaultBuildOperationExecutor.Java:336)
    at org.gradle.internal.progress.DefaultBuildOperationExecutor$RunnableBuildOperationWorker.execute(DefaultBuildOperationExecutor.Java:328)
    at org.gradle.internal.progress.DefaultBuildOperationExecutor.execute(DefaultBuildOperationExecutor.Java:197)
    at org.gradle.internal.progress.DefaultBuildOperationExecutor.run(DefaultBuildOperationExecutor.Java:107)
    at org.gradle.configuration.project.LifecycleProjectEvaluator.evaluate(LifecycleProjectEvaluator.Java:49)
    at org.gradle.api.internal.project.DefaultProject.evaluate(DefaultProject.Java:651)
    at org.gradle.api.internal.project.DefaultProject.evaluate(DefaultProject.Java:133)
    at org.gradle.api.internal.project.DefaultProjectAccessListener.evaluateProjectAndDiscoverTasks(DefaultProjectAccessListener.Java:32)
    at org.gradle.api.internal.project.DefaultProjectAccessListener.beforeResolvingProjectDependency(DefaultProjectAccessListener.Java:28)
    at org.gradle.api.internal.artifacts.dependencies.DefaultProjectDependency.beforeResolved(DefaultProjectDependency.Java:100)
    at org.gradle.api.internal.artifacts.ivyservice.moduleconverter.dependencies.ProjectIvyDependencyDescriptorFactory.createDependencyDescriptor(ProjectIvyDependencyDescriptorFactory.Java:43)
    at org.gradle.api.internal.artifacts.ivyservice.moduleconverter.dependencies.DefaultDependencyDescriptorFactory.createDependencyDescriptor(DefaultDependencyDescriptorFactory.Java:36)
    at org.gradle.api.internal.artifacts.ivyservice.moduleconverter.dependencies.DefaultDependenciesToModuleDescriptorConverter.addDependencies(DefaultDependenciesToModuleDescriptorConverter.Java:53)
    at org.gradle.api.internal.artifacts.ivyservice.moduleconverter.dependencies.DefaultDependenciesToModuleDescriptorConverter.addDependencyDescriptors(DefaultDependenciesToModuleDescriptorConverter.Java:44)
    at org.gradle.api.internal.artifacts.ivyservice.moduleconverter.DefaultConfigurationComponentMetaDataBuilder.addConfigurations(DefaultConfigurationComponentMetaDataBuilder.Java:37)
    at org.gradle.api.internal.artifacts.ivyservice.moduleconverter.DefaultRootComponentMetadataBuilder.toRootComponentMetaData(DefaultRootComponentMetadataBuilder.Java:68)
    at org.gradle.api.internal.artifacts.configurations.DefaultConfiguration.toRootComponentMetaData(DefaultConfiguration.Java:690)
    at org.gradle.api.internal.artifacts.ivyservice.resolveengine.DefaultArtifactDependencyResolver$DefaultResolveContextToComponentResolver.resolve(DefaultArtifactDependencyResolver.Java:134)
    at org.gradle.api.internal.artifacts.ivyservice.resolveengine.graph.DependencyGraphBuilder.resolve(DependencyGraphBuilder.Java:116)
    at org.gradle.api.internal.artifacts.ivyservice.resolveengine.DefaultArtifactDependencyResolver.resolve(DefaultArtifactDependencyResolver.Java:86)
    at org.gradle.api.internal.artifacts.ivyservice.DefaultConfigurationResolver.resolveGraph(DefaultConfigurationResolver.Java:138)
    at org.gradle.api.internal.artifacts.ivyservice.ShortCircuitEmptyConfigurationResolver.resolveGraph(ShortCircuitEmptyConfigurationResolver.Java:73)
    at org.gradle.api.internal.artifacts.ivyservice.ErrorHandlingConfigurationResolver.resolveGraph(ErrorHandlingConfigurationResolver.Java:66)
    ... 142 more
Caused by: Java.lang.IllegalStateException: Failed to find target with hash string 'Android-26' in: /Users/akshay/Library/Android/sdk
    at com.Android.builder.sdk.DefaultSdkLoader.getTargetInfo(DefaultSdkLoader.Java:166)
    at com.Android.build.gradle.internal.SdkHandler.initTarget(SdkHandler.Java:171)
    at com.Android.build.gradle.BasePlugin.ensureTargetSetup(BasePlugin.Java:718)
    at com.Android.build.gradle.BasePlugin.createAndroidTasks(BasePlugin.Java:600)
    at com.Android.build.gradle.BasePlugin.lambda$null$3(BasePlugin.Java:555)
    at com.Android.builder.profile.ThreadRecorder.record(ThreadRecorder.Java:81)
    at com.Android.build.gradle.BasePlugin.lambda$createTasks$4(BasePlugin.Java:551)
    at org.gradle.internal.event.BroadcastDispatch$ActionInvocationHandler.dispatch(BroadcastDispatch.Java:91)
    at org.gradle.internal.event.BroadcastDispatch$ActionInvocationHandler.dispatch(BroadcastDispatch.Java:80)
    at org.gradle.internal.event.AbstractBroadcastDispatch.dispatch(AbstractBroadcastDispatch.Java:42)
    at org.gradle.internal.event.BroadcastDispatch$SingletonDispatch.dispatch(BroadcastDispatch.Java:230)
    at org.gradle.internal.event.BroadcastDispatch$SingletonDispatch.dispatch(BroadcastDispatch.Java:149)
    at org.gradle.internal.event.AbstractBroadcastDispatch.dispatch(AbstractBroadcastDispatch.Java:58)
    at org.gradle.internal.event.BroadcastDispatch$CompositeDispatch.dispatch(BroadcastDispatch.Java:324)
    at org.gradle.internal.event.BroadcastDispatch$CompositeDispatch.dispatch(BroadcastDispatch.Java:234)
    at org.gradle.internal.event.ListenerBroadcast.dispatch(ListenerBroadcast.Java:140)
    at org.gradle.internal.event.ListenerBroadcast.dispatch(ListenerBroadcast.Java:37)
    at org.gradle.internal.dispatch.ProxyDispatchAdapter$DispatchingInvocationHandler.invoke(ProxyDispatchAdapter.Java:93)
    at com.Sun.proxy.$Proxy25.afterEvaluate(Unknown Source)
    at org.gradle.configuration.project.LifecycleProjectEvaluator.notifyAfterEvaluate(LifecycleProjectEvaluator.Java:75)
    ... 168 more


* Get more help at https://help.gradle.org

BUILD FAILED in 0s][1]][1]

build.gradle-プロジェクトレベル

// Top-level build file where you can add configuration options common to all sub-projects/modules.

buildscript {
    ext.kotlin_version = '1.1.61'
    repositories {
        jcenter()
        google()
    }
    dependencies {
        classpath 'com.Android.tools.build:gradle:3.0.1'
        classpath "org.jetbrains.kotlin:kotlin-gradle-plugin:$kotlin_version"

        // NOTE: Do not place your application dependencies here; they belong
        // in the individual module build.gradle files
        classpath 'com.google.gms:google-services:3.1.0'
    }
}

allprojects {
    repositories {
        jcenter()
        google()
    }
}

task clean(type: Delete) {
    delete rootProject.buildDir
}

build.gradle:app

apply plugin: 'com.Android.application'
apply plugin: 'kotlin-Android'
apply plugin: 'kotlin-kapt'
apply plugin: 'kotlin-Android-extensions'
apply plugin: "org.jetbrains.kotlin.Android.extensions"

Android {
    compileSdkVersion 27
    buildToolsVersion '27.0.1'
    defaultConfig {
        applicationId "com.appsmartz.wallzypremiumwallpapers"
        minSdkVersion 21
        targetSdkVersion 27
        versionCode 1
        versionName "1.0"
        multiDexEnabled true
    }
    dataBinding {
        enabled true
    }
    buildTypes {
        release {
            minifyEnabled false
            proguardFiles getDefaultProguardFile('proguard-Android.txt'), 'proguard-rules.pro'
        }
    }
    sourceSets { main { assets.srcDirs = ['src/main/assets', 'src/main/assets/'] } }
    productFlavors {
    }
}

androidExtensions {
    experimental = true
}

ext.supportLibVersion = '27.0.2'
ext.firebaseVersion = '11.6.2'

dependencies {
    compile fileTree(include: ['*.jar'], dir: 'libs')
    compile "org.jetbrains.kotlin:kotlin-stdlib-jre7:$kotlin_version"

    compile "com.Android.support:palette-v7:$supportLibVersion"

    compile "com.google.firebase:firebase-ads:$firebaseVersion"
    compile "com.google.firebase:firebase-core:$firebaseVersion"
    compile "com.google.firebase:firebase-database:$firebaseVersion"
    compile "com.google.firebase:firebase-storage:$firebaseVersion"
    compile "com.google.firebase:firebase-auth:$firebaseVersion"
    compile "com.google.Android.gms:play-services-auth:$firebaseVersion"

    compile 'com.Android.support:multidex:1.0.2'
    compile 'com.Android.support.constraint:constraint-layout:1.0.2'

    compile 'me.relex:circleindicator:[email protected]'
    compile 'com.facebook.Android:facebook-Android-sdk:4.29.0'
    compile 'com.mikhaellopez:circularfillableloaders:1.2.0'
    compile 'pub.devrel:easypermissions:0.4.2'
    //  compile 'com.jakewharton.timber:timber:4.5.1'
    kapt 'com.Android.databinding:compiler:3.0.1'
    compile project(':utilities')
}
repositories {
    mavenCentral()
    google()
}

apply plugin: 'com.google.gms.google-services'
7
Akshay Sood

他のモジュールで同じSDKバージョンを使用して問題を修正しました。

1
Akshay Sood

まあ、私の場合はすべてが正しかったので、これは重大な問題でした(おそらくバグ)。これは主にimplementation(project-lib)部分が原因で発生します。おそらくプロジェクトが初めて追加されたとき、または問題が原因でproject-libモジュールがビルドに失敗し、このエラーが発生したとき問題が解決されたとしても、その後のプロジェクトの構築を試みます。

これを引き起こす何らかの循環依存があると思います。したがって、これを回避するためのハックは次の手順です。

1。build.gradleappフォルダー内に移動し、コメントアウトimplementation(project-lib)依存関係。

2。 Gradleの変更後に表示されるオプションで今すぐ同期を押します。エラーは発生しません。あなたはそれを手に入れますか?より良い。いずれの場合も続行します。

スタジオの右側にあるGradleオプションに移動します(右側のエッジを見てください)。それを押して、main-projectをクリックすると、project-libが表示されますオプションをクリックし、次に-> [タスク]-> [ビルド]-> [デバッグをアセンブルしてリリースをアセンブル]をクリックします。

そこにproject-libが表示されない場合は、すべてのビルドフォルダーとimlファイルを手動で削除し、キャッシュを無効にして再起動する必要があります。その後、プロジェクトが表示されます。

4。以前にコメントしたアプリレベルのbuild.gradleの依存関係行のコメントを外し、しないでください今すぐ同期を押します。 -> Build-> Rebuild projectに移動します。次に、[今すぐ同期]オプションがまだある場合は、同期できます。

これでエラーはなくなりました。

N.Bこの答えは、あなたの側から抜け穴がないことを確認した後です。

2
Debanjan

次のコマンドを実行してください:

gralde clean --stacktrace  

そしてあなたはその理由を知るでしょう

幸運を。

0
Hui He

私の場合、エラーはGradleの最新バージョンを使用することで修正されました。 gradle-wrapper.propertiesのGradleバージョンを最新の here に変更します。

0
Cristan